Reaction Details
TargetCannabinoid receptor 2
LigandBDBM50314114
Substrate/Competitorn/a
Meas. Tech.ChEMBL_627676 (CHEMBL1115256)
IC50 440±n/a nM
Citation Debenham, JSMadsen-Duggan, CBToupence, RBWalsh, TFWang, JTong, XKumar, SLao, JFong, TMXiao, JCHuang, CRShen, CPFeng, YMarsh, DJStribling, DSShearman, LPStrack, AMGoulet, MT Furo[2,3-b]pyridine-based cannabinoid-1 receptor inverse agonists: synthesis and biological evaluation. Part 1. Bioorg Med Chem Lett20:1448-52 (2010) 
 
Cannabinoid receptor 2
Name:Cannabinoid receptor 2
Type:G Protein-Coupled Receptor (GPCR)
Mol. Mass.:39690.94
Organism:Homo sapiens (Human)
Description:P34972
Residue:360
BDBM50314114
NameBDBM50314114
Synonyms:(3-amino-5-(4-chlorophenyl)-6-(2,4-dichlorophenyl)furo[2,3-b]pyridin-2-yl)(phenyl)methanone | CHEMBL1089018
TypeSmall organic molecule
Emp. Form.C26H15Cl3N2O2
Mol. Mass.493.769
SMILESNc1c(oc2nc(-c3ccc(Cl)cc3Cl)c(cc12)-c1ccc(Cl)cc1)C(=O)c1ccccc1