Reaction Details
TargetCannabinoid receptor 2
LigandBDBM50314115
Substrate/Competitorn/a
Meas. Tech.ChEMBL_627676 (CHEMBL1115256)
IC50 440±n/a nM
Citation Debenham, JSMadsen-Duggan, CBToupence, RBWalsh, TFWang, JTong, XKumar, SLao, JFong, TMXiao, JCHuang, CRShen, CPFeng, YMarsh, DJStribling, DSShearman, LPStrack, AMGoulet, MT Furo[2,3-b]pyridine-based cannabinoid-1 receptor inverse agonists: synthesis and biological evaluation. Part 1. Bioorg Med Chem Lett20:1448-52 (2010) 
 
Cannabinoid receptor 2
Name:Cannabinoid receptor 2
Type:G Protein-Coupled Receptor (GPCR)
Mol. Mass.:39690.94
Organism:Homo sapiens (Human)
Description:P34972
Residue:360
BDBM50314115
NameBDBM50314115
Synonyms:1-(3-amino-5-(4-chlorophenyl)-6-(2,4-dichlorophenyl)furo[2,3-b]pyridin-2-yl)-2,2-dimethylpropan-1-one | CHEMBL1089351
TypeSmall organic molecule
Emp. Form.C24H19Cl3N2O2
Mol. Mass.473.779
SMILESCC(C)(C)C(=O)c1oc2nc(-c3ccc(Cl)cc3Cl)c(cc2c1N)-c1ccc(Cl)cc1