Reaction Details
TargetCannabinoid receptor 2
LigandBDBM50314116
Substrate/Competitorn/a
Meas. Tech.ChEMBL_627676 (CHEMBL1115256)
IC50 1900±n/a nM
Citation Debenham, JSMadsen-Duggan, CBToupence, RBWalsh, TFWang, JTong, XKumar, SLao, JFong, TMXiao, JCHuang, CRShen, CPFeng, YMarsh, DJStribling, DSShearman, LPStrack, AMGoulet, MT Furo[2,3-b]pyridine-based cannabinoid-1 receptor inverse agonists: synthesis and biological evaluation. Part 1. Bioorg Med Chem Lett20:1448-52 (2010) 
 
Cannabinoid receptor 2
Name:Cannabinoid receptor 2
Type:G Protein-Coupled Receptor (GPCR)
Mol. Mass.:39690.94
Organism:Homo sapiens (Human)
Description:P34972
Residue:360
BDBM50314116
NameBDBM50314116
Synonyms:1-(3-amino-6-(2-chlorophenyl)-5-(4-chlorophenyl)furo[2,3-b]pyridin-2-yl)-2,2-dimethylpropan-1-one | CHEMBL1089352
TypeSmall organic molecule
Emp. Form.C24H20Cl2N2O2
Mol. Mass.439.334
SMILESCC(C)(C)C(=O)c1oc2nc(-c3ccccc3Cl)c(cc2c1N)-c1ccc(Cl)cc1