Reaction Details
TargetCannabinoid receptor 1
LigandBDBM50259339
Substrate/Competitorn/a
Meas. Tech.ChEMBL_627675 (CHEMBL1115255)
IC50 1.9±n/a nM
Citation Debenham, JSMadsen-Duggan, CBToupence, RBWalsh, TFWang, JTong, XKumar, SLao, JFong, TMXiao, JCHuang, CRShen, CPFeng, YMarsh, DJStribling, DSShearman, LPStrack, AMGoulet, MT Furo[2,3-b]pyridine-based cannabinoid-1 receptor inverse agonists: synthesis and biological evaluation. Part 1. Bioorg Med Chem Lett20:1448-52 (2010) 
 
Cannabinoid receptor 1
Name:Cannabinoid receptor 1
Type:G Protein-Coupled Receptor (GPCR)
Mol. Mass.:52868.96
Organism:Homo sapiens (Human)
Description:P21554
Residue:472
BDBM50259339
NameBDBM50259339
Synonyms:5-tert-butyl-8-(2-chlorophenyl)-9-(4-chlorophenyl)pyrido[3,2-e][1,2,4]triazolo[4,3-c]pyrimidin-3(2H)-one | CHEMBL466711
TypeSmall organic molecule
Emp. Form.C24H19Cl2N5O
Mol. Mass.464.347
SMILESCC(C)(C)c1nc2nc(-c3ccccc3Cl)c(cc2c2n[nH]c(=O)n12)-c1ccc(Cl)cc1