Reaction Details
TargetMatrix metalloproteinase-9
LigandBDBM50314224
Substrate/Competitorn/a
Meas. Tech.ChEMBL_624094 (CHEMBL1103425)
IC50 13±n/a nM
Citation Nuti, ECasalini, FAvramova, SISantamaria, SFabbi, MFerrini, SMarinelli, LLa Pietra, VLimongelli, VNovellino, ECercignani, GOrlandini, ENencetti, SRossello, A Potent arylsulfonamide inhibitors of tumor necrosis factor-alpha converting enzyme able to reduce activated leukocyte cell adhesion molecule shedding in cancer cell models. J Med Chem53:2622-35 (2010) 
 
Matrix metalloproteinase-9
Name:Matrix metalloproteinase-9
Type:Enzyme
Mol. Mass.:78452.28
Organism:Homo sapiens (Human)
Description:P14780
Residue:707
BDBM50314224
NameBDBM50314224
Synonyms:(R)-2-(4-(but-2-ynyloxy)-N-isobutylphenylsulfonamido)-4-(1,3-dioxoisoindolin-2-yl)-N-hydroxybutanamide | CHEMBL1088878
TypeSmall organic molecule
Emp. Form.C26H29N3O7S
Mol. Mass.527.589
SMILESCC#CCOc1ccc(cc1)S(=O)(=O)N(CC(C)C)[C@H](CCN1C(=O)c2ccccc2C1=O)C(=O)NO