Reaction Details
TargetEukaryotic elongation factor 2 kinase
LigandBDBM50314406
Substrate/Competitorn/a
Meas. Tech.ChEMBL_624587 (CHEMBL1111547)
IC50 220±n/a nM
Citation Lockman, JWReeder, MDSuzuki, KOstanin, KHoff, RBhoite, LAustin, HBaichwal, VAdam Willardsen, J Inhibition of eEF2-K by thieno[2,3-b]pyridine analogues. Bioorg Med Chem Lett20:2283-6 (2010) 
 
Eukaryotic elongation factor 2 kinase
Name:Eukaryotic elongation factor 2 kinase
Type:Protein
Mol. Mass.:82116.99
Organism:Homo sapiens (Human)
Description:n/a
Residue:725
BDBM50314406
NameBDBM50314406
Synonyms:8-(morpholin-4-yl)-11-thia-9,14,16-triazatetracyclo[8.7.0.0^{2,7}.0^{12,17}]heptadeca-1,7,9,12(17),13,15-hexaen-13-amine | CHEMBL1091317
TypeSmall organic molecule
Emp. Form.C17H19N5OS
Mol. Mass.341.431
SMILESNc1ncnc2c1sc1nc(N3CCOCC3)c3CCCCc3c21