Reaction Details
TargetEukaryotic elongation factor 2 kinase
LigandBDBM50314415
Substrate/Competitorn/a
Meas. Tech.ChEMBL_624587 (CHEMBL1111547)
IC50 860±n/a nM
Citation Lockman, JWReeder, MDSuzuki, KOstanin, KHoff, RBhoite, LAustin, HBaichwal, VAdam Willardsen, J Inhibition of eEF2-K by thieno[2,3-b]pyridine analogues. Bioorg Med Chem Lett20:2283-6 (2010) 
 
Eukaryotic elongation factor 2 kinase
Name:Eukaryotic elongation factor 2 kinase
Type:Protein
Mol. Mass.:82116.99
Organism:Homo sapiens (Human)
Description:n/a
Residue:725
BDBM50314415
NameBDBM50314415
Synonyms:4-(3-amino-2-carbamoyl-5,6,7,8,9,10-hexahydrocycloocta[b]thieno[3,2-e]pyridin-4-yl)benzoic acid | CHEMBL1090045
TypeSmall organic molecule
Emp. Form.C21H21N3O3S
Mol. Mass.395.475
SMILESNC(=O)c1sc2nc3CCCCCCc3c(-c3ccc(cc3)C(O)=O)c2c1N