Reaction Details
TargetC-X-C chemokine receptor type 4
LigandBDBM50314758
Substrate/Competitorn/a
Meas. Tech.ChEMBL_626161 (CHEMBL1117018)
IC50 4.5±n/a nM
Citation Miller, JFTurner, EMGudmundsson, KSJenkinson, SSpaltenstein, AThomson, MWheelan, P Novel N-substituted benzimidazole CXCR4 antagonists as potential anti-HIV agents. Bioorg Med Chem Lett20:2125-8 (2010) 
 
C-X-C chemokine receptor type 4
Name:C-X-C chemokine receptor type 4
Type:Enzyme
Mol. Mass.:39754.61
Organism:Homo sapiens (Human)
Description:P61073
Residue:352
BDBM50314758
NameBDBM50314758
Synonyms:(S)-N-((1-(((S)-1-isopropylpiperidin-3-yl)methyl)-1H-benzo[d]imidazol-2-yl)methyl)-N-methyl-5,6,7,8-tetrahydroquinolin-8-amine | CHEMBL1092637
TypeSmall organic molecule
Emp. Form.C27H37N5
Mol. Mass.431.6162
SMILESCC(C)N1CCC[C@H](Cn2c(CN(C)[C@H]3CCCc4cccnc34)nc3ccccc23)C1