Reaction Details
TargetPlatelet-derived growth factor receptor alpha
LigandBDBM50314776
Substrate/Competitorn/a
Meas. Tech.ChEMBL_627031 (CHEMBL1104513)
Kd 1100±n/a nM
Citation Pettus, LHWurz, RPXu, SHerberich, BHenkle, BLiu, QMcBride, HJMu, SPlant, MHSaris, CJSherman, LWong, LMChmait, SLee, MRMohr, CHsieh, FTasker, AS Discovery and evaluation of 7-alkyl-1,5-bis-aryl-pyrazolopyridinones as highly potent, selective, and orally efficacious inhibitors of p38alpha mitogen-activated protein kinase. J Med Chem53:2973-85 (2010) 
 
Platelet-derived growth factor receptor alpha
Name:Platelet-derived growth factor receptor alpha
Type:Protein
Mol. Mass.:122633.38
Organism:Homo sapiens (Human)
Description:P16234
Residue:1089
BDBM50314776
NameBDBM50314776
Synonyms:CHEMBL1089865 | N-Cyclopropyl-3-(1-(2,6-difluorophenyl)-7-methyl-6-oxo-6,7-dihydro-1H-pyrazolo[3,4-b]pyridin-5-yl)-4-methylbenzamide
TypeSmall organic molecule
Emp. Form.C24H20F2N4O2
Mol. Mass.434.438
SMILESCc1ccc(cc1-c1cc2cnn(-c3c(F)cccc3F)c2n(C)c1=O)C(=O)NC1CC1