Reaction Details
TargetThymidine kinase 2, mitochondrial
LigandBDBM50314835
Substrate/Competitorn/a
Meas. Tech.ChEMBL_627482 (CHEMBL1111768)
IC50 230±n/a nM
Citation Van Poecke, SNegri, AGago, FVan Daele, ISolaroli, NKarlsson, ABalzarini, JVan Calenbergh, S 3'-[4-Aryl-(1,2,3-triazol-1-yl)]-3'-deoxythymidine analogues as potent and selective inhibitors of human mitochondrial thymidine kinase. J Med Chem53:2902-12 (2010) 
 
Thymidine kinase 2, mitochondrial
Name:Thymidine kinase 2, mitochondrial
Type:PROTEIN
Mol. Mass.:31013.50
Organism:Homo sapiens (Human)
Description:ChEMBL_1333885
Residue:265
BDBM50314835
NameBDBM50314835
Synonyms:3'-(4-Butyl-1,2,3-triazol-1-yl)-3'-deoxy-beta-D-thymidine | CHEMBL1089805
TypeSmall organic molecule
Emp. Form.C16H23N5O4
Mol. Mass.349.3849
SMILESCCCCc1cn(nn1)[C@H]1C[C@@H](O[C@@H]1CO)n1cc(C)c(=O)[nH]c1=O