Reaction Details
TargetThymidine kinase 2, mitochondrial
LigandBDBM50314848
Substrate/Competitorn/a
Meas. Tech.ChEMBL_627487 (CHEMBL1111773)
Ki 150±n/a nM
Citation Van Poecke, SNegri, AGago, FVan Daele, ISolaroli, NKarlsson, ABalzarini, JVan Calenbergh, S 3'-[4-Aryl-(1,2,3-triazol-1-yl)]-3'-deoxythymidine analogues as potent and selective inhibitors of human mitochondrial thymidine kinase. J Med Chem53:2902-12 (2010) 
 
Thymidine kinase 2, mitochondrial
Name:Thymidine kinase 2, mitochondrial
Type:PROTEIN
Mol. Mass.:31013.50
Organism:Homo sapiens (Human)
Description:ChEMBL_1333885
Residue:265
BDBM50314848
NameBDBM50314848
Synonyms:3'-hexanoylamino-3'-deoxythymidine | CHEMBL1089836
TypeSmall organic molecule
Emp. Form.C16H25N3O5
Mol. Mass.339.3868
SMILESCCCCCC(=O)N[C@H]1C[C@@H](O[C@@H]1CO)n1cc(C)c(=O)[nH]c1=O