Reaction Details
TargetThymidine kinase 2, mitochondrial
LigandBDBM50118490
Substrate/Competitorn/a
Meas. Tech.ChEMBL_627487 (CHEMBL1111773)
IC50 1500±n/a nM
Citation Van Poecke, SNegri, AGago, FVan Daele, ISolaroli, NKarlsson, ABalzarini, JVan Calenbergh, S 3'-[4-Aryl-(1,2,3-triazol-1-yl)]-3'-deoxythymidine analogues as potent and selective inhibitors of human mitochondrial thymidine kinase. J Med Chem53:2902-12 (2010) 
 
Thymidine kinase 2, mitochondrial
Name:Thymidine kinase 2, mitochondrial
Type:PROTEIN
Mol. Mass.:31013.50
Organism:Homo sapiens (Human)
Description:ChEMBL_1333885
Residue:265
BDBM50118490
NameBDBM50118490
Synonyms:1-[(Z)-4-(triphenylmethoxy)-2-butenyl]thymine CHEMBL101135
TypeSmall organic molecule
Emp. Form.C28H26N2O3
Mol. Mass.438.5176
SMILESCc1cn(C\C=C/COC(c2ccccc2)(c2ccccc2)c2ccccc2)c(=O)[nH]c1=O