Reaction Details
TargetMitogen-activated protein kinase 14
LigandBDBM50315107
Substrate/Competitorn/a
Meas. Tech.ChEMBL_624923 (CHEMBL1107046)
IC50 14±n/a nM
Citation Walker, JKSelness, SRDevraj, RVHepperle, MENaing, WShieh, HKurambail, RYang, SFlynn, DLBenson, AGMessing, DMDice, TKim, TLindmark, RJMonahan, JBPortanova, J Identification of SD-0006, a potent diaryl pyrazole inhibitor of p38 MAP kinase. Bioorg Med Chem Lett20:2634-8 (2010) 
 
Mitogen-activated protein kinase 14
Name:Mitogen-activated protein kinase 14
Type:Serine/threonine-protein kinase
Mol. Mass.:41286.76
Organism:Homo sapiens (Human)
Description:Q16539
Residue:360
BDBM50315107
NameBDBM50315107
Synonyms:4-(3-(4-chlorophenyl)-4-(pyridin-4-yl)-1H-pyrazol-5-yl)piperidine-1-sulfonamide | CHEMBL1089520
TypeSmall organic molecule
Emp. Form.C19H20ClN5O2S
Mol. Mass.417.912
SMILESNS(=O)(=O)N1CCC(CC1)c1[nH]nc(c1-c1ccncc1)-c1ccc(Cl)cc1