Reaction Details
TargetMitogen-activated protein kinase 14
LigandBDBM50315129
Substrate/Competitorn/a
Meas. Tech.ChEMBL_624923 (CHEMBL1107046)
IC50 25.3±n/a nM
Citation Walker, JKSelness, SRDevraj, RVHepperle, MENaing, WShieh, HKurambail, RYang, SFlynn, DLBenson, AGMessing, DMDice, TKim, TLindmark, RJMonahan, JBPortanova, J Identification of SD-0006, a potent diaryl pyrazole inhibitor of p38 MAP kinase. Bioorg Med Chem Lett20:2634-8 (2010) 
 
Mitogen-activated protein kinase 14
Name:Mitogen-activated protein kinase 14
Type:Serine/threonine-protein kinase
Mol. Mass.:41286.76
Organism:Homo sapiens (Human)
Description:Q16539
Residue:360
BDBM50315129
NameBDBM50315129
Synonyms:4-(3-(4-fluorophenyl)-5-(piperidin-4-yl)-1H-pyrazol-4-yl)pyridine | CHEMBL1091667
TypeSmall organic molecule
Emp. Form.C19H19FN4
Mol. Mass.322.3794
SMILESFc1ccc(cc1)-c1n[nH]c(C2CCNCC2)c1-c1ccncc1