Reaction Details
TargetSerine/threonine-protein kinase mTOR
LigandBDBM50315210
Substrate/Competitorn/a
Meas. Tech.ChEMBL_625172 (CHEMBL1117042)
IC50 130±n/a nM
Citation Zask, AVerheijen, JCRichard, DJKaplan, JCurran, KToral-Barza, LLucas, JHollander, IYu, K Discovery of 2-ureidophenyltriazines bearing bridged morpholines as potent and selective ATP-competitive mTOR inhibitors. Bioorg Med Chem Lett20:2644-7 (2010) 
 
Serine/threonine-protein kinase mTOR
Name:Serine/threonine-protein kinase mTOR
Type:PROTEIN
Mol. Mass.:288819.88
Organism:Rattus norvegicus
Description:ChEMBL_1460639
Residue:2549
BDBM50315210
NameBDBM50315210
Synonyms:1-(4-(4,6-di((1R,4R)-2-oxa-5-azabicyclo[2.2.1]heptan-5-yl)-1,3,5-triazin-2-yl)phenyl)-3-(4-(4-methylpiperazin-1-yl)phenyl)urea | CHEMBL1088971
TypeSmall organic molecule
Emp. Form.C31H37N9O3
Mol. Mass.583.684
SMILESCN1CCN(CC1)c1ccc(NC(=O)Nc2ccc(cc2)-c2nc(nc(n2)N2C[C@H]3C[C@@H]2CO3)N2C[C@H]3C[C@@H]2CO3)cc1