Reaction Details
TargetGonadotropin-releasing hormone receptor
LigandBDBM50315277
Substrate/Competitorn/a
Meas. Tech.ChEMBL_625918 (CHEMBL1115144)
IC50 5.7±n/a nM
Citation Vera, MDLundquist, JTChengalvala, MVCottom, JEFeingold, IBGarrick, LMGreen, DMHauze, DBMann, CWMehlmann, JFRogers, JFShanno, LWrobel, JEPelletier, JC Synthesis and biological evaluation of piperazinyl heterocyclic antagonists of the gonadotropin releasing hormone (GnRH) receptor. Bioorg Med Chem Lett20:2512-5 (2010) 
 
Gonadotropin-releasing hormone receptor
Name:Gonadotropin-releasing hormone receptor
Type:PROTEIN
Mol. Mass.:37767.60
Organism:Rattus norvegicus
Description:ChEMBL_1335047
Residue:327
BDBM50315277
NameBDBM50315277
Synonyms:5-((4-(2-(4-tert-butylphenyl)imidazo[1,2-a]pyridin-8-yl)piperazin-1-yl)methyl)-1-ethylpyrimidine-2,4(1H,3H)-dione | CHEMBL1091579
TypeSmall organic molecule
Emp. Form.C28H34N6O2
Mol. Mass.486.6086
SMILESCCn1cc(CN2CCN(CC2)c2cccn3cc(nc23)-c2ccc(cc2)C(C)(C)C)c(=O)[nH]c1=O