Reaction Details
TargetGonadotropin-releasing hormone receptor
LigandBDBM50315276
Substrate/Competitorn/a
Meas. Tech.ChEMBL_625920 (CHEMBL1115146)
IC50 20±n/a nM
Citation Vera, MDLundquist, JTChengalvala, MVCottom, JEFeingold, IBGarrick, LMGreen, DMHauze, DBMann, CWMehlmann, JFRogers, JFShanno, LWrobel, JEPelletier, JC Synthesis and biological evaluation of piperazinyl heterocyclic antagonists of the gonadotropin releasing hormone (GnRH) receptor. Bioorg Med Chem Lett20:2512-5 (2010) 
 
Gonadotropin-releasing hormone receptor
Name:Gonadotropin-releasing hormone receptor
Type:Enzyme
Mol. Mass.:37749.45
Organism:Homo sapiens (Human)
Description:P30968
Residue:328
BDBM50315276
NameBDBM50315276
Synonyms:5-((4-(2-(4-tert-butylphenyl)imidazo[1,2-a]pyridin-8-yl)piperazin-1-yl)methyl)pyrimidine-2,4(1H,3H)-dione | CHEMBL1091209
TypeSmall organic molecule
Emp. Form.C26H30N6O2
Mol. Mass.458.5554
SMILESCC(C)(C)c1ccc(cc1)-c1cn2cccc(N3CCN(Cc4c[nH]c(=O)[nH]c4=O)CC3)c2n1