Reaction Details
TargetProstaglandin E2 receptor EP3 subtype
LigandBDBM50315980
Substrate/Competitorn/a
Meas. Tech.ChEMBL_625741 (CHEMBL1104418)
Ki 0.065±n/a nM
Citation Asada, MObitsu, TKinoshita, ANakai, YNagase, TSugimoto, ITanaka, MTakizawa, HYoshikawa, KSato, KNarita, MOhuchida, SNakai, HToda, M Discovery of novel N-acylsulfonamide analogs as potent and selective EP3 receptor antagonists. Bioorg Med Chem Lett20:2639-43 (2010) 
 
Prostaglandin E2 receptor EP3 subtype
Name:Prostaglandin E2 receptor EP3 subtype
Type:G-protein coupled receptor
Mol. Mass.:40092.50
Organism:Mus musculus (Mouse)
Description:n/a
Residue:365
BDBM50315980
NameBDBM50315980
Synonyms:3-(4-((1H-pyrazol-1-yl)methyl)-2-(2-(naphthalen-2-yl)ethoxy)phenyl)-N-(3-cyanophenylsulfonyl)propanamide | CHEMBL1091742
TypeSmall organic molecule
Emp. Form.C32H28N4O4S
Mol. Mass.564.654
SMILESO=C(CCc1ccc(Cn2cccn2)cc1OCCc1ccc2ccccc2c1)NS(=O)(=O)c1cccc(c1)C#N