Reaction Details
TargetEukaryotic translation initiation factor 4E
LigandBDBM50316307
Substrate/Competitorn/a
Meas. Tech.ChEMBL_627826 (CHEMBL1117203)
Kd 1990±n/a nM
Citation Jia, YChiu, TLAmin, EAPolunovsky, VBitterman, PBWagner, CR Design, synthesis and evaluation of analogs of initiation factor 4E (eIF4E) cap-binding antagonist Bn7-GMP. Eur J Med Chem45:1304-13 (2010) 
 
Eukaryotic translation initiation factor 4E
Name:Eukaryotic translation initiation factor 4E
Type:PROTEIN
Mol. Mass.:25051.39
Organism:Mus musculus
Description:ChEMBL_627826
Residue:217
BDBM50316307
NameBDBM50316307
Synonyms:((2R,3S,4R,5R)-5-(2-Amino-7-(4-chlorobenzyl)-6-oxo-1Hpurin-1-ium-9(6H)-yl)-3,4-dihydroxytetrahydrofuran-2-yl)methylphosphate | CHEMBL1095620
TypeSmall organic molecule
Emp. Form.C17H19ClN5O8P
Mol. Mass.487.788
SMILESNc1nc2n(c[n+](Cc3ccc(Cl)cc3)c2c(=O)[nH]1)[C@@H]1O[C@H](COP(O)([O-])=O)[C@@H](O)[C@H]1O