Reaction Details
TargetGlutamate receptor 3
LigandBDBM50105843
Substrate/Competitorn/a
Meas. Tech.ChEMBL_628128 (CHEMBL1108139)
IC50 30±n/a nM
Citation Fleming, JJEngland, PM Developing a complete pharmacology for AMPA receptors: a perspective on subtype-selective ligands. Bioorg Med Chem18:1381-7 (2010) 
 
Glutamate receptor 3
Name:Glutamate receptor 3
Type:PROTEIN
Mol. Mass.:101172.14
Organism:Homo sapiens (Human)
Description:ChEMBL_468627
Residue:894
BDBM50105843
NameBDBM50105843
Synonyms:2-Amino-N-{3-[4-(3-amino-propylamino)-butylamino]-propyl}-acetamide Joro spider toxin 3 | N*1*-(5-{3-[4-(3-Amino-propylamino)-butylamino]-propionylamino}-pentyl)-2-[2-(2,4-dihydroxy-phenyl)-acetylamino]-succinamide
TypeSmall organic molecule
Emp. Form.C27H47N7O6
Mol. Mass.565.7054
SMILESNCCCNCCCCNCCC(=O)NCCCCCNC(=O)[C@H](CC(N)=O)NC(=O)Cc1ccc(O)cc1O