Reaction Details
TargetGlutamate receptor 3
LigandBDBM50316373
Substrate/Competitorn/a
Meas. Tech.ChEMBL_628137 (CHEMBL1108148)
IC50 230±n/a nM
Citation Fleming, JJEngland, PM Developing a complete pharmacology for AMPA receptors: a perspective on subtype-selective ligands. Bioorg Med Chem18:1381-7 (2010) 
 
Glutamate receptor 3
Name:Glutamate receptor 3
Type:PROTEIN
Mol. Mass.:101172.14
Organism:Homo sapiens (Human)
Description:ChEMBL_468627
Residue:894
BDBM50316373
NameBDBM50316373
Synonyms:Argiotoxin-636 | CHEMBL1098240
TypeSmall organic molecule
Emp. Form.C29H52N10O6
Mol. Mass.636.7866
SMILES[#7]-[#6@@H](-[#6]-[#6]-[#6]\[#7]=[#6](\[#7])-[#7])-[#6](=O)-[#7]-[#6]-[#6]-[#6]-[#7]-[#6]-[#6]-[#6]-[#7]-[#6]-[#6]-[#6]-[#6]-[#6]-[#7]-[#6](=O)-[#6@H](-[#6]-[#6](-[#7])=O)-[#7]-[#6](=O)-[#6]-c1ccc(-[#8])cc1-[#8]