Reaction Details
TargetGlutamate receptor 1
LigandBDBM50316376
Substrate/Competitorn/a
Meas. Tech.ChEMBL_627982 (CHEMBL1105503)
EC50 270±n/a nM
Citation Fleming, JJEngland, PM Developing a complete pharmacology for AMPA receptors: a perspective on subtype-selective ligands. Bioorg Med Chem18:1381-7 (2010) 
 
Glutamate receptor 1
Name:Glutamate receptor 1
Type:Enzyme Catalytic Domain
Mol. Mass.:101512.92
Organism:Homo sapiens (Human)
Description:Glutamate AMPA 1 GRIA1 HUMAN::P42261
Residue:906
BDBM50316376
NameBDBM50316376
Synonyms:(S)-2-amino-3-(3-carboxy-5-methyl-4-isoxazolyl)propionic acid CHEMBL602962 | S)-4-(2-amino-2-carboxyethyl)-5-methylisoxazole-3-carboxylic acid
TypeSmall organic molecule
Emp. Form.C8H10N2O5
Mol. Mass.214.1754
SMILESCc1onc(C(O)=O)c1C[C@H](N)C(O)=O