Reaction Details
TargetAminopeptidase N
LigandBDBM23971
Substrate/Competitorn/a
Meas. Tech.ChEMBL_628651 (CHEMBL1106417)
IC50 2400±n/a nM
Citation Li, QFang, HWang, XXu, W Novel cyclic-imide peptidomimetics as aminopeptidase N inhibitors. Structure-based design, chemistry and activity evaluation. II. Eur J Med Chem45:1618-26 (2010) 
 
Aminopeptidase N
Name:Aminopeptidase N
Type:PROTEIN
Mol. Mass.:109522.63
Organism:Homo sapiens (Human)
Description:ChEMBL_1507526
Residue:967
BDBM23971
NameBDBM23971
Synonyms:(2S)-2-[(2S,3R)-3-amino-2-hydroxy-4-phenylbutanamido]-4-methylpentanoic acid CHEMBL29292 | Ubenimex
TypeSmall organic molecule
Emp. Form.C16H24N2O4
Mol. Mass.308.3728
SMILESCC(C)C[C@H](NC(=O)[C@@H](O)[C@H](N)Cc1ccccc1)C(O)=O