Reaction Details
TargetPlasmepsin II
LigandBDBM7977
Substrate/Competitorn/a
Meas. Tech.ChEMBL_631755 (CHEMBL1114776)
Ki 0.5±n/a nM
Citation Gupta, DYedidi, RSVarghese, SKovari, LCWoster, PM Mechanism-based inhibitors of the aspartyl protease plasmepsin II as potential antimalarial agents. J Med Chem53:4234-47 (2010) 
 
Plasmepsin II
Name:Plasmepsin II
Type:Enzyme
Mol. Mass.:51482.09
Organism:Plasmodium falciparum
Description:P46925
Residue:453
BDBM7977
NameBDBM7977
Synonyms:(3S,4S)-5-[(4-bromophenyl)methoxy]-N-[(1S)-1-{[(1S)-1-carbamoyl-3-methylbutyl]carbamoyl}ethyl]-3-hydroxy-4-[(2S)-3-methyl-2-(pyridin-2-ylformamido)butanamido]pentanamide Pyridine-2-carboxylic Acid ((S)-1-{(1S,2S)-1-(4-Bromobenzyloxymethyl)3-[(S)-1-((S)-1-carbamoyl-3-methyl-butylcarbamoyl)ethylcarbamoyl]-2-hydroxypropylcarbamoyl}-2-methylpropyl)amide | Statine-like inhibitor 16
TypeSmall organic molecule
Emp. Form.C32H45BrN6O7
Mol. Mass.705.64
SMILESCC(C)C[C@H](NC(=O)[C@H](C)NC(=O)C[C@H](O)[C@H](COCc1ccc(Br)cc1)NC(=O)[C@@H](NC(=O)c1ccccn1)C(C)C)C(N)=O