Reaction Details
TargetArginase-1
LigandBDBM50316607
Substrate/Competitorn/a
Meas. Tech.ChEMBL_631783 (CHEMBL1108176)
Ki 300000±n/a nM
Citation Ilies, MDi Costanzo, LNorth, MLScott, JAChristianson, DW 2-aminoimidazole amino acids as inhibitors of the binuclear manganese metalloenzyme human arginase I. J Med Chem53:4266-76 (2010) 
 
Arginase-1
Name:Arginase-1
Type:PROTEIN
Mol. Mass.:34737.53
Organism:Homo sapiens (Human)
Description:ChEMBL_978893
Residue:322
BDBM50316607
NameBDBM50316607
Synonyms:2-amino-L-histidine L-2-aminohistidine
TypeSmall organic molecule
Emp. Form.C6H10N4O2
Mol. Mass.170.1692
SMILESN[C@@H](Cc1cnc(N)[nH]1)C(O)=O