Reaction Details
TargetVascular endothelial growth factor receptor 3
LigandBDBM50316792
Substrate/Competitorn/a
Meas. Tech.ChEMBL_632818 (CHEMBL1111032)
IC50 2980±n/a nM
Citation Büttner, ACottin, TXu, JTzagkaroulaki, LGiannis, A Serotonin derivatives as a new class of non-ATP-competitive receptor tyrosine kinase inhibitors. Bioorg Med Chem18:3387-402 (2010) 
 
Vascular endothelial growth factor receptor 3
Name:Vascular endothelial growth factor receptor 3
Type:Protein
Mol. Mass.:152749.58
Organism:Homo sapiens (Human)
Description:P35916-2
Residue:1363
BDBM50316792
NameBDBM50316792
Synonyms:2-{5-(4-Hydroxyphenethoxy)-1-[4-(3-trifluoromethylphenyl)]benzyl-1H-indole-3-yl}ethanamine hydrochloride | CHEMBL1094195
TypeSmall organic molecule
Emp. Form.C32H29F3N2O2
Mol. Mass.530.5801
SMILESNCCc1cn(Cc2ccc(cc2)-c2cccc(c2)C(F)(F)F)c2ccc(OCCc3ccc(O)cc3)cc12