Reaction Details
TargetPolyphenol oxidase 2
LigandBDBM50068224
Substrate/Competitorn/a
Meas. Tech.ChEMBL_629402 (CHEMBL1105755)
IC50 4800±n/a nM
Citation Seo, WDRyu, YBCurtis-Long, MJLee, CWRyu, HWJang, KCPark, KH Evaluation of anti-pigmentary effect of synthetic sulfonylamino chalcone. Eur J Med Chem45:2010-7 (2010) 
 
Polyphenol oxidase 2
Name:Polyphenol oxidase 2
Type:Protein
Mol. Mass.:63923.66
Organism:Agaricus bisporus (Common mushroom)
Description:O42713
Residue:556
BDBM50068224
NameBDBM50068224
Synonyms:(E)-1,3-Bis-(4-hydroxy-phenyl)-propenone 4',4-Dihydroxychalcone CHEMBL145927
TypeSmall organic molecule
Emp. Form.C15H12O3
Mol. Mass.240.254
SMILESOc1ccc(\C=C\C(=O)c2ccc(O)cc2)cc1