Reaction Details
TargetAdenosine receptor A1
LigandBDBM50317008
Substrate/Competitorn/a
Meas. Tech.ChEMBL_630131 (CHEMBL1113722)
Ki 0.5±n/a nM
Citation Shook, BCRassnick, SHall, DRupert, KCHeintzelman, GRHansen, KChakravarty, DBullington, JLScannevin, RHMagliaro, BWestover, LCarroll, KLampron, LRussell, RBranum, SWells, KDamon, SYouells, SLi, XOsbourne, MDemarest, KTang, YRhodes, KJackson, PF Methylene amine substituted arylindenopyrimidines as potent adenosine A(2A)/A(1) antagonists. Bioorg Med Chem Lett20:2864-7 (2010) 
 
Adenosine receptor A1
Name:Adenosine receptor A1
Type:G Protein-Coupled Receptor (GPCR)
Mol. Mass.:36520.92
Organism:Homo sapiens (Human)
Description:P30542
Residue:326
BDBM50317008
NameBDBM50317008
Synonyms:2-amino-4-(5-chlorofuran-2-yl)-5H-indeno[1,2-d]pyrimidin-5-one | CHEMBL1097494
TypeSmall organic molecule
Emp. Form.C15H8ClN3O2
Mol. Mass.297.696
SMILESNc1nc2-c3ccccc3C(=O)c2c(n1)-c1ccc(Cl)o1