Reaction Details
TargetAdenosine receptor A2a
LigandBDBM50317023
Substrate/Competitorn/a
Meas. Tech.ChEMBL_630130 (CHEMBL1113721)
Ki 3.8±n/a nM
Citation Shook, BCRassnick, SHall, DRupert, KCHeintzelman, GRHansen, KChakravarty, DBullington, JLScannevin, RHMagliaro, BWestover, LCarroll, KLampron, LRussell, RBranum, SWells, KDamon, SYouells, SLi, XOsbourne, MDemarest, KTang, YRhodes, KJackson, PF Methylene amine substituted arylindenopyrimidines as potent adenosine A(2A)/A(1) antagonists. Bioorg Med Chem Lett20:2864-7 (2010) 
 
Adenosine receptor A2a
Name:Adenosine receptor A2a
Type:G Protein-Coupled Receptor (GPCR)
Mol. Mass.:44716.46
Organism:Homo sapiens (Human)
Description:P29274
Residue:412
BDBM50317023
NameBDBM50317023
Synonyms:2-amino-4-(4-fluorophenyl)-9-(morpholinomethyl)-5H-indeno[1,2-d]pyrimidin-5-one | CHEMBL1087463
TypeSmall organic molecule
Emp. Form.C22H19FN4O2
Mol. Mass.390.4103
SMILESNc1nc2-c3c(cccc3CN3CCOCC3)C(=O)c2c(n1)-c1ccc(F)cc1