Reaction Details
TargetThymidine kinase, cytosolic
LigandBDBM50317617
Substrate/Competitorn/a
Meas. Tech.ChEMBL_632888 (CHEMBL1107470)
IC50 44000±n/a nM
Citation Lin, JRoy, VWang, LYou, LAgrofoglio, LADeville-Bonne, DMcBrayer, TRCoats, SJSchinazi, RFEriksson, S 3'-(1,2,3-Triazol-1-yl)-3'-deoxythymidine analogs as substrates for human and Ureaplasma parvum thymidine kinase for structure-activity investigations. Bioorg Med Chem18:3261-9 (2010) 
 
Thymidine kinase, cytosolic
Name:Thymidine kinase, cytosolic
Type:PROTEIN
Mol. Mass.:25476.50
Organism:Homo sapiens (Human)
Description:ChEMBL_1333884
Residue:234
BDBM50317617
NameBDBM50317617
Synonyms:3'-(4-(4-Fluorophenyl)-1,2,3-triazole-1-yl)-2'-deoxythymidine | CHEMBL1098549
TypeSmall organic molecule
Emp. Form.C18H18FN5O4
Mol. Mass.387.365
SMILESCc1cn([C@H]2C[C@@H]([C@@H](CO)O2)n2cc(nn2)-c2ccc(F)cc2)c(=O)[nH]c1=O