Reaction Details
TargetThymidine kinase
LigandBDBM50317618
Substrate/Competitorn/a
Meas. Tech.ChEMBL_632671 (CHEMBL1112809)
IC50 120000±n/a nM
Citation Lin, JRoy, VWang, LYou, LAgrofoglio, LADeville-Bonne, DMcBrayer, TRCoats, SJSchinazi, RFEriksson, S 3'-(1,2,3-Triazol-1-yl)-3'-deoxythymidine analogs as substrates for human and Ureaplasma parvum thymidine kinase for structure-activity investigations. Bioorg Med Chem18:3261-9 (2010) 
 
Thymidine kinase
Name:Thymidine kinase
Type:PROTEIN
Mol. Mass.:25374.94
Organism:Ureaplasma parvum
Description:ChEMBL_632671
Residue:223
BDBM50317618
NameBDBM50317618
Synonyms:3'-(4-(2-Phenyl-ethyl)-1,2,3-triazole-1-yl)-2'-deoxythymidine | CHEMBL1096828
TypeSmall organic molecule
Emp. Form.C20H23N5O4
Mol. Mass.397.4277
SMILESCc1cn([C@H]2C[C@@H]([C@@H](CO)O2)n2cc(CCc3ccccc3)nn2)c(=O)[nH]c1=O