Reaction Details
TargetThymidine kinase
LigandBDBM50317620
Substrate/Competitorn/a
Meas. Tech.ChEMBL_632671 (CHEMBL1112809)
IC50 318000±n/a nM
Citation Lin, JRoy, VWang, LYou, LAgrofoglio, LADeville-Bonne, DMcBrayer, TRCoats, SJSchinazi, RFEriksson, S 3'-(1,2,3-Triazol-1-yl)-3'-deoxythymidine analogs as substrates for human and Ureaplasma parvum thymidine kinase for structure-activity investigations. Bioorg Med Chem18:3261-9 (2010) 
 
Thymidine kinase
Name:Thymidine kinase
Type:PROTEIN
Mol. Mass.:25374.94
Organism:Ureaplasma parvum
Description:ChEMBL_632671
Residue:223
BDBM50317620
NameBDBM50317620
Synonyms:3'-(4-tert-Butyl-1,2,3-triazol-1-yl)-3'-deoxythymidine | CHEMBL1098218
TypeSmall organic molecule
Emp. Form.C16H23N5O4
Mol. Mass.349.3849
SMILESCc1cn([C@H]2C[C@@H]([C@@H](CO)O2)n2cc(nn2)C(C)(C)C)c(=O)[nH]c1=O