Reaction Details
TargetThymidine kinase
LigandBDBM50317622
Substrate/Competitorn/a
Meas. Tech.ChEMBL_632671 (CHEMBL1112809)
IC50 208000±n/a nM
Citation Lin, JRoy, VWang, LYou, LAgrofoglio, LADeville-Bonne, DMcBrayer, TRCoats, SJSchinazi, RFEriksson, S 3'-(1,2,3-Triazol-1-yl)-3'-deoxythymidine analogs as substrates for human and Ureaplasma parvum thymidine kinase for structure-activity investigations. Bioorg Med Chem18:3261-9 (2010) 
 
Thymidine kinase
Name:Thymidine kinase
Type:PROTEIN
Mol. Mass.:25374.94
Organism:Ureaplasma parvum
Description:ChEMBL_632671
Residue:223
BDBM50317622
NameBDBM50317622
Synonyms:3'-(4-(3-Chloro-propyl)-1,2,3-triazol-1-yl)-3'-deoxythymidine | CHEMBL1098660
TypeSmall organic molecule
Emp. Form.C15H21N5O4
Mol. Mass.335.3583
SMILESCCCc1cn(nn1)[C@H]1C[C@@H](O[C@@H]1CO)n1cc(C)c(=O)[nH]c1=O