Reaction Details
TargetHistamine H3 receptor
LigandBDBM50317865
Substrate/Competitorn/a
Meas. Tech.ChEMBL_629959 (CHEMBL1112036)
Ki 0.170000±n/a nM
Citation Ishikawa, MShinei, RYokoyama, FYamauchi, MOyama, MOkuma, KNagayama, TKato, KKakui, NSato, Y Role of hydrophobic substituents on the terminal nitrogen of histamine in receptor binding and agonist activity: development of an orally active histamine type 3 receptor agonist and evaluation of its antistress activity in mice. J Med Chem53:3840-4 (2010) 
 
Histamine H3 receptor
Name:Histamine H3 receptor
Type:G Protein-Coupled Receptor (GPCR)
Mol. Mass.:48691.47
Organism:Homo sapiens (Human)
Description:Binding assays were using CHO cells stably expressing hH3R receptors.
Residue:445
BDBM50317865
NameBDBM50317865
Synonyms:2-(2-(4-tert-Butylphenylthio)ethyl)-1H-imidazole CHEMBL1098230
TypeSmall organic molecule
Emp. Form.C15H20N2S
Mol. Mass.260.398
SMILESCC(C)(C)c1ccc(SCCc2cnc[nH]2)cc1