Reaction Details
TargetHistamine H3 receptor
LigandBDBM50317870
Substrate/Competitorn/a
Meas. Tech.ChEMBL_629960 (CHEMBL1112037)
EC50 88±n/a nM
Citation Ishikawa, MShinei, RYokoyama, FYamauchi, MOyama, MOkuma, KNagayama, TKato, KKakui, NSato, Y Role of hydrophobic substituents on the terminal nitrogen of histamine in receptor binding and agonist activity: development of an orally active histamine type 3 receptor agonist and evaluation of its antistress activity in mice. J Med Chem53:3840-4 (2010) 
 
Histamine H3 receptor
Name:Histamine H3 receptor
Type:G Protein-Coupled Receptor (GPCR)
Mol. Mass.:48691.47
Organism:Homo sapiens (Human)
Description:Binding assays were using CHO cells stably expressing hH3R receptors.
Residue:445
BDBM50317870
NameBDBM50317870
Synonyms:4-(2-(4-Methylphenylamino)ethyl)-1H-imidazole | CHEMBL1096515
TypeSmall organic molecule
Emp. Form.C12H15N3
Mol. Mass.201.2676
SMILESCc1ccc(NCCc2cnc[nH]2)cc1