Reaction Details
TargetD(3) dopamine receptor
LigandBDBM50317865
Substrate/Competitorn/a
Meas. Tech.ChEMBL_630145 (CHEMBL1113736)
Ki>1000±n/a nM
Citation Ishikawa, MShinei, RYokoyama, FYamauchi, MOyama, MOkuma, KNagayama, TKato, KKakui, NSato, Y Role of hydrophobic substituents on the terminal nitrogen of histamine in receptor binding and agonist activity: development of an orally active histamine type 3 receptor agonist and evaluation of its antistress activity in mice. J Med Chem53:3840-4 (2010) 
 
D(3) dopamine receptor
Name:D(3) dopamine receptor
Type:n/a
Mol. Mass.:44243.43
Organism:Homo sapiens (Human)
Description:n/a
Residue:400
BDBM50317865
NameBDBM50317865
Synonyms:2-(2-(4-tert-Butylphenylthio)ethyl)-1H-imidazole CHEMBL1098230
TypeSmall organic molecule
Emp. Form.C15H20N2S
Mol. Mass.260.398
SMILESCC(C)(C)c1ccc(SCCc2cnc[nH]2)cc1