Reaction Details
TargetSerine/threonine-protein kinase PLK3
LigandBDBM50318062
Substrate/Competitorn/a
Meas. Tech.ChEMBL_631391 (CHEMBL1109143)
IC50 37±n/a nM
Citation Beria, IBallinari, DBertrand, JABorghi, DBossi, RTBrasca, MGCappella, PCaruso, MCeccarelli, WCiavolella, ACristiani, CCroci, VDe Ponti, AFachin, GFerguson, RDLansen, JMoll, JKPesenti, EPosteri, HPerego, RRocchetti, MStorici, PVolpi, DValsasina, B Identification of 4,5-dihydro-1H-pyrazolo[4,3-h]quinazoline derivatives as a new class of orally and selective Polo-like kinase 1 inhibitors. J Med Chem53:3532-51 (2010) 
 
Serine/threonine-protein kinase PLK3
Name:Serine/threonine-protein kinase PLK3
Type:Serine/threonine-protein kinase
Mol. Mass.:71655.17
Organism:Homo sapiens (Human)
Description:Enzyme assays were using PLK3 purified from baculovirus-infected Trichoplusia ni cells expressing full-length PLK3.
Residue:646
BDBM50318062
NameBDBM50318062
Synonyms:8-[(2-Fluorophenyl)amino]-1-methyl-4,5-dihydro-1H-pyrazolo-[4,3-h]quinazoline-3-carboxamide | CHEMBL1095771
TypeSmall organic molecule
Emp. Form.C17H15FN6O
Mol. Mass.338.339
SMILESCn1nc(C(N)=O)c2CCc3cnc(Nc4ccccc4F)nc3-c12