Reaction Details
TargetSerine/threonine-protein kinase PLK1
LigandBDBM50318063
Substrate/Competitorn/a
Meas. Tech.ChEMBL_631389 (CHEMBL1109141)
IC50 40±n/a nM
Citation Beria, IBallinari, DBertrand, JABorghi, DBossi, RTBrasca, MGCappella, PCaruso, MCeccarelli, WCiavolella, ACristiani, CCroci, VDe Ponti, AFachin, GFerguson, RDLansen, JMoll, JKPesenti, EPosteri, HPerego, RRocchetti, MStorici, PVolpi, DValsasina, B Identification of 4,5-dihydro-1H-pyrazolo[4,3-h]quinazoline derivatives as a new class of orally and selective Polo-like kinase 1 inhibitors. J Med Chem53:3532-51 (2010) 
 
Serine/threonine-protein kinase PLK1
Name:Serine/threonine-protein kinase PLK1
Type:Serine/threonine-protein kinase
Mol. Mass.:68277.16
Organism:Homo sapiens (Human)
Description:P53350
Residue:603
BDBM50318063
NameBDBM50318063
Synonyms:8-{[2-Methoxy-4-(4-methylpiperazin-1-yl)phenyl]amino}-1-methyl-4,5-dihydro-1H-pyrazolo[4,3-h]quinazoline-3-carboxamide | CHEMBL1095717
TypeSmall organic molecule
Emp. Form.C23H28N8O2
Mol. Mass.448.5208
SMILESCOc1cc(ccc1Nc1ncc2CCc3c(nn(C)c3-c2n1)C(N)=O)N1CCN(C)CC1