Reaction Details
TargetSerine/threonine-protein kinase PLK2
LigandBDBM50318085
Substrate/Competitorn/a
Meas. Tech.ChEMBL_631390 (CHEMBL1109142)
IC50 2±n/a nM
Citation Beria, IBallinari, DBertrand, JABorghi, DBossi, RTBrasca, MGCappella, PCaruso, MCeccarelli, WCiavolella, ACristiani, CCroci, VDe Ponti, AFachin, GFerguson, RDLansen, JMoll, JKPesenti, EPosteri, HPerego, RRocchetti, MStorici, PVolpi, DValsasina, B Identification of 4,5-dihydro-1H-pyrazolo[4,3-h]quinazoline derivatives as a new class of orally and selective Polo-like kinase 1 inhibitors. J Med Chem53:3532-51 (2010) 
 
Serine/threonine-protein kinase PLK2
Name:Serine/threonine-protein kinase PLK2
Type:Serine/threonine-protein kinase
Mol. Mass.:78259.87
Organism:Homo sapiens (Human)
Description:Full-length human PLK2 was expressed as GST-fusion protein using baculovirus expression system. GST-PLK2 was purified by using glutathione sepharose chromatography.
Residue:685
BDBM50318085
NameBDBM50318085
Synonyms:1-Methyl-8-[(2-methylphenyl)amino]-4,5-dihydro-1H-pyrazolo-[4,3-h]quinazoline-3-carboxamide | CHEMBL1094477
TypeSmall organic molecule
Emp. Form.C18H18N6O
Mol. Mass.334.3751
SMILESCc1ccccc1Nc1ncc2CCc3c(nn(C)c3-c2n1)C(N)=O