Reaction Details
TargetVascular endothelial growth factor receptor 2
LigandBDBM50271848
Substrate/Competitorn/a
Meas. Tech.ChEMBL_632395 (CHEMBL1115600)
IC50>200000±n/a nM
Citation Gangjee, ANamjoshi, OAIhnat, MABuchanan, A The contribution of a 2-amino group on receptor tyrosine kinase inhibition and antiangiogenic activity in 4-anilinosubstituted pyrrolo[2,3-d]pyrimidines. Bioorg Med Chem Lett20:3177-81 (2010) 
 
Vascular endothelial growth factor receptor 2
Name:Vascular endothelial growth factor receptor 2
Type:Receptor Tyrosine Kinase
Mol. Mass.:151510.97
Organism:Homo sapiens (Human)
Description:P35968
Residue:1356
BDBM50271848
NameBDBM50271848
Synonyms:6-phenethyl-N4-(3-(trifluoromethyl)phenyl)-7H-pyrrolo[2,3-d]pyrimidine-2,4-diamine N4-(3-Trifluromethylphenyl)-6-(2-phenylethyl)-7Hpyrrolo[2,3-d]pyrimidine-2,4-diamine
TypeSmall organic molecule
Emp. Form.C21H18F3N5
Mol. Mass.397.3963
SMILESNc1nc(Nc2cccc(c2)C(F)(F)F)c2cc(CCc3ccccc3)[nH]c2n1