Reaction Details
TargetEpidermal growth factor receptor
LigandBDBM3032
Substrate/Competitorn/a
Meas. Tech.ChEMBL_632680 (CHEMBL1112818)
IC50 200±n/a nM
Citation Gangjee, AKurup, SIhnat, MAThorpe, JEShenoy, SS Synthesis and biological activity of N(4)-phenylsubstituted-6-(2,4-dichloro phenylmethyl)-7H-pyrrolo[2,3-d]pyrimidine-2,4-diamines as vascular endothelial growth factor receptor-2 inhibitors and antiangiogenic and antitumor agents. Bioorg Med Chem18:3575-87 (2010) 
 
Epidermal growth factor receptor
Name:Epidermal growth factor receptor
Type:Receptor Kinase Domain
Mol. Mass.:134279.59
Organism:Homo sapiens (Human)
Description:P00533
Residue:1210
BDBM3032
NameBDBM3032
Synonyms:CHEMBL1204168 N-(3-bromophenyl)-6,7-dimethoxyquinazolin-4-amine US11001595, Compound PD153035 US9422297, PD153035
TypeSmall organic molecule
Emp. Form.C16H14BrN3O2
Mol. Mass.360.205
SMILESCOc1cc2ncnc(Nc3cccc(Br)c3)c2cc1OC