Reaction Details
TargetVascular endothelial growth factor receptor 1
LigandBDBM50318179
Substrate/Competitorn/a
Meas. Tech.ChEMBL_632679 (CHEMBL1112817)
IC50>300000±n/a nM
Citation Gangjee, AKurup, SIhnat, MAThorpe, JEShenoy, SS Synthesis and biological activity of N(4)-phenylsubstituted-6-(2,4-dichloro phenylmethyl)-7H-pyrrolo[2,3-d]pyrimidine-2,4-diamines as vascular endothelial growth factor receptor-2 inhibitors and antiangiogenic and antitumor agents. Bioorg Med Chem18:3575-87 (2010) 
 
Vascular endothelial growth factor receptor 1
Name:Vascular endothelial growth factor receptor 1
Type:Receptor Tyrosine Kinase
Mol. Mass.:150800.23
Organism:Homo sapiens (Human)
Description:P17948
Residue:1338
BDBM50318179
NameBDBM50318179
Synonyms:CHEMBL1094808 | N4-(3-Fluoro-4-trifluoromethylphenyl)-6-(2,4-dichlorobenzyl)-7H-pyrrolo[2,3-d]pyrimidine-2,4-diamine
TypeSmall organic molecule
Emp. Form.C20H13Cl2F4N5
Mol. Mass.470.25
SMILESNc1nc(Nc2ccc(c(F)c2)C(F)(F)F)c2cc(Cc3ccc(Cl)cc3Cl)[nH]c2n1