Reaction Details
TargetVascular endothelial growth factor receptor 2
LigandBDBM50318182
Substrate/Competitorn/a
Meas. Tech.ChEMBL_632678 (CHEMBL1112816)
IC50 200±n/a nM
Citation Gangjee, AKurup, SIhnat, MAThorpe, JEShenoy, SS Synthesis and biological activity of N(4)-phenylsubstituted-6-(2,4-dichloro phenylmethyl)-7H-pyrrolo[2,3-d]pyrimidine-2,4-diamines as vascular endothelial growth factor receptor-2 inhibitors and antiangiogenic and antitumor agents. Bioorg Med Chem18:3575-87 (2010) 
 
Vascular endothelial growth factor receptor 2
Name:Vascular endothelial growth factor receptor 2
Type:Receptor Tyrosine Kinase
Mol. Mass.:151510.97
Organism:Homo sapiens (Human)
Description:P35968
Residue:1356
BDBM50318182
NameBDBM50318182
Synonyms:CHEMBL1095464 | N4-(3-bromophenyl)-6-(2-methylbenzyl)-7H-pyrrolo[2,3-d]pyrimidine-2,4-diamine
TypeSmall organic molecule
Emp. Form.C20H18BrN5
Mol. Mass.408.294
SMILESCc1ccccc1Cc1cc2c(Nc3cccc(Br)c3)nc(N)nc2[nH]1