Reaction Details
TargetEpidermal growth factor receptor
LigandBDBM50318186
Substrate/Competitorn/a
Meas. Tech.ChEMBL_632680 (CHEMBL1112818)
IC50>300000±n/a nM
Citation Gangjee, AKurup, SIhnat, MAThorpe, JEShenoy, SS Synthesis and biological activity of N(4)-phenylsubstituted-6-(2,4-dichloro phenylmethyl)-7H-pyrrolo[2,3-d]pyrimidine-2,4-diamines as vascular endothelial growth factor receptor-2 inhibitors and antiangiogenic and antitumor agents. Bioorg Med Chem18:3575-87 (2010) 
 
Epidermal growth factor receptor
Name:Epidermal growth factor receptor
Type:Receptor Kinase Domain
Mol. Mass.:134279.59
Organism:Homo sapiens (Human)
Description:P00533
Residue:1210
BDBM50318186
NameBDBM50318186
Synonyms:CHEMBL1094783 | N-(3-bromophenyl)-6-(2,4-dichlorobenzyl)-7H-pyrrolo[2,3-d]pyrimidin-4-amine
TypeSmall organic molecule
Emp. Form.C19H13BrCl2N4
Mol. Mass.448.143
SMILESClc1ccc(Cc2cc3c(Nc4cccc(Br)c4)ncnc3[nH]2)c(Cl)c1