Reaction Details
TargetPlatelet-derived growth factor receptor beta
LigandBDBM50318188
Substrate/Competitorn/a
Meas. Tech.ChEMBL_632681 (CHEMBL1112819)
IC50 142200±n/a nM
Citation Gangjee, AKurup, SIhnat, MAThorpe, JEShenoy, SS Synthesis and biological activity of N(4)-phenylsubstituted-6-(2,4-dichloro phenylmethyl)-7H-pyrrolo[2,3-d]pyrimidine-2,4-diamines as vascular endothelial growth factor receptor-2 inhibitors and antiangiogenic and antitumor agents. Bioorg Med Chem18:3575-87 (2010) 
 
Platelet-derived growth factor receptor beta
Name:Platelet-derived growth factor receptor beta
Type:Enzyme
Mol. Mass.:123922.25
Organism:Homo sapiens (Human)
Description:P09619
Residue:1106
BDBM50318188
NameBDBM50318188
Synonyms:6-(2,4-dichlorobenzyl)-N-(3-ethynylphenyl)-7H-pyrrolo[2,3-d]pyrimidin-4-amine | CHEMBL1098440
TypeSmall organic molecule
Emp. Form.C21H14Cl2N4
Mol. Mass.393.269
SMILESClc1ccc(Cc2cc3c(Nc4cccc(c4)C#C)ncnc3[nH]2)c(Cl)c1