Reaction Details
TargetTyrosine-protein kinase ABL1
LigandBDBM50318870
Substrate/Competitorn/a
Meas. Tech.ChEMBL_633633 (CHEMBL1117891)
IC50 68±n/a nM
Citation Allen, JGFotsch, CBabij, P Emerging targets in osteoporosis disease modification. J Med Chem53:4332-53 (2010) 
 
Tyrosine-protein kinase ABL1
Name:Tyrosine-protein kinase ABL1
Type:Enzyme
Mol. Mass.:122897.30
Organism:Homo sapiens (Human)
Description:P00519
Residue:1130
BDBM50318870
NameBDBM50318870
Synonyms:((4-(2-(cis-4-aminocyclohexyl)-9-ethyl-9H-purin-6-ylamino)phenyl)(hydroxy)phosphoryl)methylphosphonic acid 2,6,9-Trisubstituted Purine, AP23451 | CHEMBL1084268
TypeSmall organic molecule
Emp. Form.C20H28N6O5P2
Mol. Mass.494.421
SMILESCCn1cnc2c(Nc3ccc(cc3)P(O)(=O)CP(O)(O)=O)nc(nc12)[C@H]1CC[C@H](N)CC1