Reaction Details
TargetProtein-tyrosine kinase 2-beta
LigandBDBM50318872
Substrate/Competitorn/a
Meas. Tech.ChEMBL_633640 (CHEMBL1117898)
IC50 637±n/a nM
Citation Allen, JGFotsch, CBabij, P Emerging targets in osteoporosis disease modification. J Med Chem53:4332-53 (2010) 
 
Protein-tyrosine kinase 2-beta
Name:Protein-tyrosine kinase 2-beta
Type:Protein
Mol. Mass.:115868.80
Organism:Homo sapiens (Human)
Description:Q14289
Residue:1009
BDBM50318872
NameBDBM50318872
Synonyms:1-(3-tert-butyl-1-p-tolyl-1H-pyrazol-5-yl)-3-(3-((pyridin-3-yloxy)methyl)-1H-pyrazol-5-yl)urea PF-4618433
TypeSmall organic molecule
Emp. Form.C24H27N7O2
Mol. Mass.445.5169
SMILESCc1ccc(cc1)-n1nc(cc1NC(=O)Nc1cc(COc2cccnc2)n[nH]1)C(C)(C)C