Reaction Details
TargetExtracellular calcium-sensing receptor
LigandBDBM50318875
Substrate/Competitorn/a
Meas. Tech.ChEMBL_633356 (CHEMBL1120576)
IC50 520±n/a nM
Citation Allen, JGFotsch, CBabij, P Emerging targets in osteoporosis disease modification. J Med Chem53:4332-53 (2010) 
 
Extracellular calcium-sensing receptor
Name:Extracellular calcium-sensing receptor
Type:Protein
Mol. Mass.:120663.13
Organism:Homo sapiens (Human)
Description:P41180
Residue:1078
BDBM50318875
NameBDBM50318875
Synonyms:(R)-ethyl 3-(4-cyano-3-(3-(1-(2,3-dihydro-1H-inden-2-yl)-2-methylpropan-2-ylamino)-2-hydroxypropoxy)phenyl)propanoate | CHEMBL1084514
TypeSmall organic molecule
Emp. Form.C28H36N2O4
Mol. Mass.464.5964
SMILESCCOC(=O)CCc1ccc(C#N)c(OC[C@H](O)CNC(C)(C)CC2Cc3ccccc3C2)c1