Reaction Details
TargetIntegrin alpha-V/beta-3
LigandBDBM50318878
Substrate/Competitorn/a
Meas. Tech.ChEMBL_633353 (CHEMBL1120573)
IC50 0.19±n/a nM
Citation Allen, JGFotsch, CBabij, P Emerging targets in osteoporosis disease modification. J Med Chem53:4332-53 (2010) 
 
Integrin alpha-V/beta-3
Name:Integrin alpha-V/beta-3
Type:Enzyme
Mol. Mass.:n/a
Description:n/a
Components:This complex has 2 components.
Component 1
Name:Integrin alpha-V
Synonyms:ITAV_HUMAN Integrin alpha-V/alpha-5 VNRA Vitronectin receptor | Vitronectin receptor subunit alpha
Type:PROTEIN
Mol. Mass.:116024.92
Organism:Homo sapiens (Human)
Description:ChEMBL_582336
Residue:1048
Component 2
Name:Integrin beta-3
Synonyms:CD_antigen=CD61 GPIIIa ITGB3 Platelet membrane glycoprotein IIIa
Type:Protein
Mol. Mass.:87038.91
Organism:Homo sapiens (Human)
Description:P05106
Residue:788
BDBM50318878
NameBDBM50318878
Synonyms:(S)-3-(3-methoxy-4-(4-(1,4,5,6-tetrahydropyrimidin-2-ylamino)piperidin-1-yl)benzamido)-2-(phenylsulfonamido)propanoic acid | CHEMBL1083695
TypeSmall organic molecule
Emp. Form.C26H34N6O6S
Mol. Mass.558.65
SMILESCOc1cc(ccc1N1CCC(CC1)NC1=NCCCN1)C(=O)NC[C@H](NS(=O)(=O)c1ccccc1)C(O)=O