Reaction Details
TargetCathepsin K
LigandBDBM50255753
Substrate/Competitorn/a
Meas. Tech.ChEMBL_633770 (CHEMBL1119720)
IC50 0.2±n/a nM
Citation Allen, JGFotsch, CBabij, P Emerging targets in osteoporosis disease modification. J Med Chem53:4332-53 (2010) 
 
Cathepsin K
Name:Cathepsin K
Type:Enzyme
Mol. Mass.:36975.68
Organism:Homo sapiens (Human)
Description:P43235
Residue:329
BDBM50255753
NameBDBM50255753
Synonyms:CHEMBL481611 Odanacatib
TypeSmall organic molecule
Emp. Form.C25H27F4N3O3S
Mol. Mass.525.559
SMILESCC(C)(F)C[C@H](N[C@@H](c1ccc(cc1)-c1ccc(cc1)S(C)(=O)=O)C(F)(F)F)C(=O)NC1(CC1)C#N